[Bamboo] Jetty - Trunk build 3041 has FAILED (0 tests failed). Change made by janb

classic Classic list List threaded Threaded
1 message Options
Reply | Threaded
Open this post in threaded view
|

[Bamboo] Jetty - Trunk build 3041 has FAILED (0 tests failed). Change made by janb

Codehaus Bamboo
JETTY-TRUNK-3041 failed.
Code has been updated by janb.
No failed tests found, a possible compilation error.

Code Changes See full change details
janb
Prevent build of test-jaas-webapp until issue with constraint handling being discussed on jetty lists under thread "Security Constraints problem" is resolved.
(5226)

Error Summary See full build log
[INFO] ------------------------------------------------------------------------
[ERROR] BUILD FAILURE
[INFO] ------------------------------------------------------------------------
[INFO] Compilation failure

/opt/j2ee/domains/ci.codehaus.org/bamboo/webapps/atlassian-bamboo/data/atlassian-bamboo-2.1.4/xml-data/build-dir/JETTY-TRUNK/example-async-rest-webapp/src/main/java/org/mortbay/demo/AbstractRestServlet.java:[39,32] package org.eclipse.jetty.client does not exist

/opt/j2ee/domains/ci.codehaus.org/bamboo/webapps/atlassian-bamboo/data/atlassian-bamboo-2.1.4/xml-data/build-dir/JETTY-TRUNK/example-async-rest-webapp/src/main/java/org/mortbay/demo/AbstractRestServlet.java:[40,32] package org.eclipse.jetty.client does not exist

/opt/j2ee/domains/ci.codehaus.org/bamboo/webapps/atlassian-bamboo/data/atlassian-bamboo-2.1.4/xml-data/build-dir/JETTY-TRUNK/example-async-rest-webapp/src/main/java/org/mortbay/demo/AbstractRestServlet.java:[43,35] package org.eclipse.jetty.util.ajax does not exist

/opt/j2ee/domains/ci.codehaus.org/bamboo/webapps/atlassian-bamboo/data/atlassian-bamboo-2.1.4/xml-data/build-dir/JETTY-TRUNK/example-async-rest-webapp/src/main/java/org/mortbay/demo/AsyncRestServlet.java:[38,32] package org.eclipse.jetty.client does not exist

/opt/j2ee/domains/ci.codehaus.org/bamboo/webapps/atlassian-bamboo/data/atlassian-bamboo-2.1.4/xml-data/build-dir/JETTY-TRUNK/example-async-rest-webapp/src/main/java/org/mortbay/demo/AsyncRestServlet.java:[39,32] package org.eclipse.jetty.client does not exist

/opt/j2ee/domains/ci.codehaus.org/bamboo/webapps/atlassian-bamboo/data/atlassian-bamboo-2.1.4/xml-data/build-dir/JETTY-TRUNK/example-async-rest-webapp/src/main/java/org/mortbay/demo/AsyncRestServlet.java:[42,35] package org.eclipse.jetty.util.ajax does not exist

/opt/j2ee/domains/ci.codehaus.org/bamboo/webapps/atlassian-bamboo/data/atlassian-bamboo-2.1.4/xml-data/build-dir/JETTY-TRUNK/example-async-rest-webapp/src/main/java/org/mortbay/demo/AsyncRestServlet.java:[60,4] cannot find symbol
symbol  : class HttpClient
location: class org.mortbay.demo.AsyncRestServlet

/opt/j2ee/domains/ci.codehaus.org/bamboo/webapps/atlassian-bamboo/data/atlassian-bamboo-2.1.4/xml-data/build-dir/JETTY-TRUNK/example-async-rest-webapp/src/main/java/org/mortbay/demo/SerialRestServlet.java:[40,35] package org.eclipse.jetty.util.ajax does not exist

/opt/j2ee/domains/ci.codehaus.org/bamboo/webapps/atlassian-bamboo/data/atlassian-bamboo-2.1.4/xml-data/build-dir/JETTY-TRUNK/example-async-rest-webapp/src/main/java/org/mortbay/demo/AsyncRestServlet.java:[66,22] cannot find symbol
symbol  : class HttpClient
location: class org.mortbay.demo.AsyncRestServlet

/opt/j2ee/domains/ci.codehaus.org/bamboo/webapps/atlassian-bamboo/data/atlassian-bamboo-2.1.4/xml-data/build-dir/JETTY-TRUNK/example-async-rest-webapp/src/main/java/org/mortbay/demo/AsyncRestServlet.java:[67,33] cannot find symbol
symbol  : variable HttpClient
location: class org.mortbay.demo.AsyncRestServlet

/opt/j2ee/domains/ci.codehaus.org/bamboo/webapps/atlassian-bamboo/data/atlassian-bamboo-2.1.4/xml-data/build-dir/JETTY-TRUNK/example-async-rest-webapp/src/main/java/org/mortbay/demo/AsyncRestServlet.java:[159,8] cannot find symbol
symbol  : class ContentExchange
location: class org.mortbay.demo.AsyncRestServlet

/opt/j2ee/domains/ci.codehaus.org/bamboo/webapps/atlassian-bamboo/data/atlassian-bamboo-2.1.4/xml-data/build-dir/JETTY-TRUNK/example-async-rest-webapp/src/main/java/org/mortbay/demo/AsyncRestServlet.java:[159,39] cannot find symbol
symbol  : class ContentExchange
location: class org.mortbay.demo.AsyncRestServlet

/opt/j2ee/domains/ci.codehaus.org/bamboo/webapps/atlassian-bamboo/data/atlassian-bamboo-2.1.4/xml-data/build-dir/JETTY-TRUNK/example-async-rest-webapp/src/main/java/org/mortbay/demo/SerialRestServlet.java:[63,29] cannot find symbol
symbol  : variable JSON
location: class org.mortbay.demo.SerialRestServlet


[INFO] ------------------------------------------------------------------------
[INFO] For more information, run Maven with the -e switch

Email generated by Atlassian Bamboo - if you wish to stop receiving these emails edit your user profile or notify your administrator
Want this information in your IDE?
Actions
View Online
Add Comments
View Artifacts
Download Logs
Link to JIRA issue